Reaction Details
TargetFibroblast growth factor 1
LigandBDBM50144525
Substrate/Competitorn/a
Meas. Tech.ChEBML_70464
Kd 104000±n/a nM
Citation Liu, LPing Li, CCochran, SFerro, V Application of the four-component Ugi condensation for the preparation of sulfated glycoconjugate libraries. Bioorg Med Chem Lett14:2221-6 (2004) 
 
Fibroblast growth factor 1
Name:Fibroblast growth factor 1
Type:Protein
Mol. Mass.:17461.01
Organism:Homo sapiens (Human)
Description:P05230
Residue:155
BDBM50144525
NameBDBM50144525
Synonyms:CHEMBL70844 | Sodium sulfated glycoconjugate derivative
TypeSmall organic molecule
Emp. Form.C22H22N2O19S4
Mol. Mass.746.674
SMILES[O-]S(=O)(=O)OC1OC(C(OS([O-])(=O)=O)C(OS([O-])(=O)=O)C1OS([O-])(=O)=O)C(=O)N(CC(=O)NCc1ccccc1)Cc1ccccc1