Reaction Details
TargetFibroblast growth factor 2
LigandBDBM50144520
Substrate/Competitorn/a
Meas. Tech.ChEMBL_70634 (CHEMBL678690)
Kd>800000±n/a nM
Citation Liu, LPing Li, CCochran, SFerro, V Application of the four-component Ugi condensation for the preparation of sulfated glycoconjugate libraries. Bioorg Med Chem Lett14:2221-6 (2004) 
 
Fibroblast growth factor 2
Name:Fibroblast growth factor 2
Type:Protein
Mol. Mass.:30803.89
Organism:Homo sapiens (Human)
Description:P09038
Residue:288
BDBM50144520
NameBDBM50144520
Synonyms:CHEMBL308715 | Sodium sulfated glycoconjugate derivative
TypeSmall organic molecule
Emp. Form.C27H30N2O19S4
Mol. Mass.814.791
SMILES[O-]S(=O)(=O)OC1OC(C(OS([O-])(=O)=O)C(OS([O-])(=O)=O)C1OS([O-])(=O)=O)C(=O)N(Cc1ccccc1)C(C(=O)NC1CCCCC1)c1ccccc1