Reaction Details
TargetIntegrin alpha-4/beta-1
LigandBDBM50105372
Substrate/Competitorn/a
Meas. Tech.ChEMBL_213403 (CHEMBL815426)
IC50 0.070000±n/a nM
Citation Lin, LSLanza, TJCastonguay, LAKamenecka, TMcCauley, EVan Riper, GEgger, LAMumford, RATong, XMacCoss, MSchmidt, JAHagmann, WK Bioisosteric replacement of anilide with benzoxazole: potent and orally bioavailable antagonists of VLA-4. Bioorg Med Chem Lett14:2331-4 (2004) 
 
Integrin alpha-4/beta-1
Name:Integrin alpha-4/beta-1
Type:n/a
Mol. Mass.:n/a
Description:ASSAY_ID of EBI is 88912
Components:This complex has 2 components.
Component 1
Name:Integrin beta-1
Synonyms:CD_antigen=CD29 Fibronectin receptor beta GPIIA ITGB1 MDF2 | MSK12
Type:Enzyme
Mol. Mass.:88400.38
Organism:Homo sapiens (Human)
Description:P05556
Residue:798
Component 2
Name:Integrin alpha-4
Synonyms:CD49 antigen-like family member D CD49d antigen ITA4_HUMAN Integrin alpha-4 Integrin alpha-IV VLA-4 integrin alpha 4 precursor | integrin alpha-4 precursor
Type:Membrane Protein
Mol. Mass.:114897.35
Organism:Homo sapiens (Human)
Description:P13612
Residue:1032
BDBM50105372
NameBDBM50105372
Synonyms:(S)-2-{[(S)-1-(3,5-Dichloro-benzenesulfonyl)-2-methyl-azetidine-2-carbonyl]-amino}-3-(2',6'-dimethoxy-biphenyl-4-yl)-propionic acid | CHEMBL309823
TypeSmall organic molecule
Emp. Form.C28H28Cl2N2O7S
Mol. Mass.607.502
SMILESCOc1cccc(OC)c1-c1ccc(C[C@H](NC(=O)[C@]2(C)CCN2S(=O)(=O)c2cc(Cl)cc(Cl)c2)C(O)=O)cc1