Reaction Details
TargetIntegrin alpha-4/beta-7
LigandBDBM50144789
Substrate/Competitorn/a
Meas. Tech.ChEMBL_217617 (CHEMBL820360)
IC50 179±n/a nM
Citation Lin, LSLanza, TJCastonguay, LAKamenecka, TMcCauley, EVan Riper, GEgger, LAMumford, RATong, XMacCoss, MSchmidt, JAHagmann, WK Bioisosteric replacement of anilide with benzoxazole: potent and orally bioavailable antagonists of VLA-4. Bioorg Med Chem Lett14:2331-4 (2004) 
 
Integrin alpha-4/beta-7
Name:Integrin alpha-4/beta-7
Type:Protein Complex
Mol. Mass.:n/a
Description:The assay uses stably transfected K562 cells expressing human alpha4beta7 integrin.
Components:This complex has 2 components.
Component 1
Name:Integrin alpha-4
Synonyms:CD49 antigen-like family member D CD49d antigen ITA4_HUMAN Integrin alpha-4 Integrin alpha-IV VLA-4 integrin alpha 4 precursor | integrin alpha-4 precursor
Type:Membrane Protein
Mol. Mass.:114897.35
Organism:Homo sapiens (Human)
Description:P13612
Residue:1032
Component 2
Name:Integrin beta-7
Synonyms:ITB7_HUMAN Integrin alpha-4/beta-7 Integrin beta7
Type:Membrane Protein
Mol. Mass.:86893.88
Organism:Homo sapiens (Human)
Description:P26010
Residue:798
BDBM50144789
NameBDBM50144789
Synonyms:(S)-2-{[(S)-1-(3,5-Dichloro-benzenesulfonyl)-azetidine-2-carbonyl]-amino}-3-[2-(2,6-dichloro-phenyl)-benzooxazol-5-yl]-propionic acid | CHEMBL77924
TypeSmall organic molecule
Emp. Form.C26H19Cl4N3O6S
Mol. Mass.643.323
SMILESOC(=O)[C@H](Cc1ccc2oc(nc2c1)-c1c(Cl)cccc1Cl)NC(=O)[C@@H]1CCN1S(=O)(=O)c1cc(Cl)cc(Cl)c1