Reaction Details
TargetIntegrin alpha-4/beta-1
LigandBDBM50144786
Substrate/Competitorn/a
Meas. Tech.ChEMBL_213402 (CHEMBL815425)
IC50 1.8±n/a nM
Citation Lin, LSLanza, TJCastonguay, LAKamenecka, TMcCauley, EVan Riper, GEgger, LAMumford, RATong, XMacCoss, MSchmidt, JAHagmann, WK Bioisosteric replacement of anilide with benzoxazole: potent and orally bioavailable antagonists of VLA-4. Bioorg Med Chem Lett14:2331-4 (2004) 
 
Integrin alpha-4/beta-1
Name:Integrin alpha-4/beta-1
Type:n/a
Mol. Mass.:n/a
Description:ASSAY_ID of EBI is 88912
Components:This complex has 2 components.
Component 1
Name:Integrin beta-1
Synonyms:CD_antigen=CD29 Fibronectin receptor beta GPIIA ITGB1 MDF2 | MSK12
Type:Enzyme
Mol. Mass.:88400.38
Organism:Homo sapiens (Human)
Description:P05556
Residue:798
Component 2
Name:Integrin alpha-4
Synonyms:CD49 antigen-like family member D CD49d antigen ITA4_HUMAN Integrin alpha-4 Integrin alpha-IV VLA-4 integrin alpha 4 precursor | integrin alpha-4 precursor
Type:Membrane Protein
Mol. Mass.:114897.35
Organism:Homo sapiens (Human)
Description:P13612
Residue:1032
BDBM50144786
NameBDBM50144786
Synonyms:(S)-2-{[(S)-1-(3,5-Dichloro-benzenesulfonyl)-azetidine-2-carbonyl]-amino}-3-[2-(2,6-dichloro-phenyl)-1H-benzoimidazol-5-yl]-propionic acid | CHEMBL76295
TypeSmall organic molecule
Emp. Form.C26H20Cl4N4O5S
Mol. Mass.642.338
SMILESOC(=O)[C@H](Cc1ccc2nc([nH]c2c1)-c1c(Cl)cccc1Cl)NC(=O)[C@@H]1CCN1S(=O)(=O)c1cc(Cl)cc(Cl)c1