Reaction Details
Target5-hydroxytryptamine receptor 2A
LigandBDBM50144837
Substrate/Competitorn/a
Meas. Tech.ChEMBL_2263 (CHEMBL617050)
EC50 602±n/a nM
Citation Bentley, JMAdams, DRBebbington, DBenwell, KRBickerdike, MJDavidson, JEDawson, CEDourish, CTDuncton, MAGaur, SGeorge, ARGiles, PRHamlyn, RJKennett, GAKnight, ARMalcolm, CSMansell, HLMisra, AMonck, NJPratt, RMQuirk, KRoffey, JRVickers, SPCliffe, IA Indoline derivatives as 5-HT(2C) receptor agonists. Bioorg Med Chem Lett14:2367-70 (2004) 
 
5-hydroxytryptamine receptor 2A
Name:5-hydroxytryptamine receptor 2A
Type:undefined
Mol. Mass.:52607.65
Organism:Homo sapiens (Human)
Description:P28223
Residue:471
BDBM50144837
NameBDBM50144837
Synonyms:(S)-2-(6-Chloro-2,3-dihydro-indol-1-yl)-1-methyl-ethylamine | CHEMBL76307
TypeSmall organic molecule
Emp. Form.C11H15ClN2
Mol. Mass.210.703
SMILESC[C@H](N)CN1CCc2ccc(Cl)cc12