Reaction Details
TargetGamma-aminobutyric acid receptor subunit alpha-1/beta-3/gamma-2
LigandBDBM50144861
Substrate/Competitorn/a
Meas. Tech.ChEMBL_70091 (CHEMBL677037)
Ki 0.93±n/a nM
Citation Sternfeld, FCarling, RWJelley, RALadduwahetty, TMerchant, KJMoore, KWReeve, AJStreet, LJO'Connor, DSohal, BAtack, JRCook, SSeabrook, GWafford, KTattersall, FDCollinson, NDawson, GRCastro, JLMacLeod, AM Selective, orally active gamma-aminobutyric acidA alpha5 receptor inverse agonists as cognition enhancers. J Med Chem47:2176-9 (2004) 
 
Gamma-aminobutyric acid receptor subunit alpha-1/beta-3/gamma-2
Name:Gamma-aminobutyric acid receptor subunit alpha-1/beta-3/gamma-2
Type:Protein
Mol. Mass.:n/a
Description:n/a
Components:This complex has 3 components.
Component 1
Name:Gamma-aminobutyric acid receptor subunit alpha-1
Synonyms:Benzodiazepine central GABA A Benzodiazepine liver GABA(A) receptor subunit alpha-1 GABA-A receptor GBRA1_HUMAN TBPS | agonist GABA site
Type:Protein
Mol. Mass.:51817.35
Organism:Homo sapiens (Human)
Description:P14867
Residue:456
Component 2
Name:Gamma-aminobutyric acid receptor subunit beta-3
Synonyms:GABA A receptor alpha-4/beta-3/gamma-2 GABA-A receptor GBRB3_HUMAN | agonist GABA site
Type:PROTEIN
Mol. Mass.:54130.51
Organism:Homo sapiens (Human)
Description:ChEMBL_448071
Residue:473
Component 3
Name:Gamma-aminobutyric acid receptor subunit gamma-2
Synonyms:GABA(A) receptor subunit gamma-2 GBRG2_HUMAN
Type:PROTEIN
Mol. Mass.:54172.74
Organism:Homo sapiens (Human)
Description:EBI_217
Residue:467
BDBM50144861
NameBDBM50144861
Synonyms:3-(5-Methyl-isoxazol-3-yl)-6-(pyridin-2-ylmethoxy)-[1,2,4]triazolo[3,4-a]phthalazine CHEMBL68684
TypeSmall organic molecule
Emp. Form.C19H14N6O2
Mol. Mass.358.3535
SMILESCc1cc(no1)-c1nnc2c3ccccc3c(OCc3ccccn3)nn12