Reaction Details
TargetHPr kinase/phosphorylase
LigandBDBM50144927
Substrate/Competitorn/a
Meas. Tech.ChEMBL_87254 (CHEMBL699244)
EC50 93000±n/a nM
Citation Ramström, HBourotte, MPhilippe, CSchmitt, MHaiech, JBourguignon, JJ Heterocyclic bis-cations as starting hits for design of inhibitors of the bifunctional enzyme histidine-containing protein kinase/phosphatase from Bacillus subtilis. J Med Chem47:2264-75 (2004) 
 
HPr kinase/phosphorylase
Name:HPr kinase/phosphorylase
Type:PROTEIN
Mol. Mass.:34693.07
Organism:Bacillus subtilis
Description:ChEMBL_81578
Residue:310
BDBM50144927
NameBDBM50144927
Synonyms:3-[5-(2-amino-1-benzyl-1H-benzo[d]imidazol-3-ium-3-yl)pentyl]-1-benzyl-1H-benzo[d]imidazol-3-ium-2-amine | CHEMBL72369
TypeSmall organic molecule
Emp. Form.C33H36N6
Mol. Mass.516.678
SMILES[NH2+]=c1n(CCCCCn2c3ccccc3n(Cc3ccccc3)c2=[NH2+])c2ccccc2n1Cc1ccccc1