Reaction Details
TargetPotassium voltage-gated channel subfamily A member 3
LigandBDBM50145059
Substrate/Competitorn/a
Meas. Tech.ChEMBL_214956 (CHEMBL821185)
Kd 700±n/a nM
Citation Baell, JBGable, RWHarvey, AJToovey, NHerzog, THänsel, WWulff, H Khellinone derivatives as blockers of the voltage-gated potassium channel Kv1.3: synthesis and immunosuppressive activity. J Med Chem47:2326-36 (2004) 
 
Potassium voltage-gated channel subfamily A member 3
Name:Potassium voltage-gated channel subfamily A member 3
Type:PROTEIN
Mol. Mass.:63835.47
Organism:Homo sapiens (Human)
Description:ChEMBL_1513935
Residue:575
BDBM50145059
NameBDBM50145059
Synonyms:(E)-1-(6-Hydroxy-4,7-dimethoxy-benzofuran-5-yl)-3-p-tolyl-propenone | CHEMBL78325
TypeSmall organic molecule
Emp. Form.C20H18O5
Mol. Mass.338.3539
SMILESCOc1c(O)c(C(=O)\C=C\c2ccc(C)cc2)c(OC)c2ccoc12