Reaction Details
TargetPotassium voltage-gated channel subfamily A member 3
LigandBDBM50145070
Substrate/Competitorn/a
Meas. Tech.ChEMBL_214956 (CHEMBL821185)
Kd 3100±n/a nM
Citation Baell, JBGable, RWHarvey, AJToovey, NHerzog, THänsel, WWulff, H Khellinone derivatives as blockers of the voltage-gated potassium channel Kv1.3: synthesis and immunosuppressive activity. J Med Chem47:2326-36 (2004) 
 
Potassium voltage-gated channel subfamily A member 3
Name:Potassium voltage-gated channel subfamily A member 3
Type:PROTEIN
Mol. Mass.:63835.47
Organism:Homo sapiens (Human)
Description:ChEMBL_1513935
Residue:575
BDBM50145070
NameBDBM50145070
Synonyms:1-{6-[4-(5-Acetyl-4,7-dimethoxy-benzofuran-6-yloxymethyl)-benzyloxy]-4,7-dimethoxy-benzofuran-5-yl}-ethanone | CHEMBL75159
TypeSmall organic molecule
Emp. Form.C32H30O10
Mol. Mass.574.5746
SMILESCOc1c(OCc2ccc(COc3c(OC)c4occc4c(OC)c3C(C)=O)cc2)c(C(C)=O)c(OC)c2ccoc12