Reaction Details
TargetPoly [ADP-ribose] polymerase 1
LigandBDBM50145223
Substrate/Competitorn/a
Meas. Tech.ChEBML_159827
Ki 5.6±n/a nM
Citation White, AWCurtin, NJEastman, BWGolding, BTHostomsky, ZKyle, SLi, JMaegley, KASkalitzky, DJWebber, SEYu, XHGriffin, RJ Potentiation of cytotoxic drug activity in human tumour cell lines, by amine-substituted 2-arylbenzimidazole-4-carboxamide PARP-1 inhibitors. Bioorg Med Chem Lett14:2433-7 (2004) 
 
Poly [ADP-ribose] polymerase 1
Name:Poly [ADP-ribose] polymerase 1
Type:n/a
Mol. Mass.:113114.22
Organism:Homo sapiens (Human)
Description:P09874
Residue:1014
BDBM50145223
NameBDBM50145223
Synonyms:2-(3-Dimethylaminomethyl-phenyl)-1H-benzoimidazole-4-carboxylic acid amide | CHEMBL82434
TypeSmall organic molecule
Emp. Form.C17H18N4O
Mol. Mass.294.351
SMILESCN(C)Cc1cccc(c1)-c1nc2c(cccc2[nH]1)C(N)=O