Reaction Details
TargetAdenosine receptor A3
LigandBDBM50117223
Substrate/Competitorn/a
Meas. Tech.ChEMBL_31412 (CHEMBL644555)
IC50<0.100000±n/a nM
Citation Okamura, TKurogi, YHashimoto, KNishikawa, HNagao, Y Facile synthesis of fused 1,2,4-triazolo[1,5-c]pyrimidine derivatives as human adenosine A3 receptor ligands. Bioorg Med Chem Lett14:2443-6 (2004) 
 
Adenosine receptor A3
Name:Adenosine receptor A3
Type:G Protein-Coupled Receptor (GPCR)
Mol. Mass.:36197.32
Organism:Homo sapiens (Human)
Description:P0DMS8
Residue:318
BDBM50117223
NameBDBM50117223
Synonyms:5-Butyl-8-(4-methoxy-phenyl)-3H-[1,2,4]triazolo[5,1-i]purine | CHEMBL331111
TypeSmall organic molecule
Emp. Form.C17H18N6O
Mol. Mass.322.3644
SMILESCCCCc1nc2nc[nH]c2c2nc(nn12)-c1ccc(OC)cc1