Reaction Details
TargetIntegrin alpha-L/Integrin beta-2/Intercellular adhesion molecule 1
LigandBDBM50145392
Substrate/Competitorn/a
Meas. Tech.ChEMBL_90530 (CHEMBL700600)
IC50 50±n/a nM
Citation Ullrich, TBaumann, KWelzenbach, KSchmutz, SCamenisch, GMeingassner, JGWeitz-Schmidt, G Statin-derived 1,3-oxazinan-2-ones as submicromolar inhibitors of LFA-1/ICAM-1 interaction: stabilization of the metabolically labile vanillyl side chain. Bioorg Med Chem Lett14:2483-7 (2004) 
 
Integrin alpha-L/Integrin beta-2/Intercellular adhesion molecule 1
Name:Integrin alpha-L/Integrin beta-2/Intercellular adhesion molecule 1
Type:n/a
Mol. Mass.:n/a
Description:ASSAY_ID of EBI is 97281
Components:This complex has 3 components.
Component 1
Name:Integrin alpha-L
Synonyms:CD11 antigen-like family member A CD_antigen=CD11a ITGAL LFA-1A Leukocyte adhesion glycoprotein LFA-1 alpha chain | Leukocyte function-associated molecule 1 alpha chain
Type:PROTEIN
Mol. Mass.:128748.90
Organism:Homo sapiens (Human)
Description:ChEMBL_629045
Residue:1170
Component 2
Name:Intercellular adhesion molecule 1
Synonyms:CD_antigen=CD54 ICAM1 Intercellular adhesion molecule (ICAM-1), Integrin alpha-L/beta-2 Intercellular adhesion molecule-1 | Major group rhinovirus receptor
Type:PROTEIN
Mol. Mass.:57831.10
Organism:Homo sapiens (Human)
Description:ChEMBL_826675
Residue:532
Component 3
Name:Integrin beta-2
Synonyms:CD18 ITGB2 MFI7
Type:PROTEIN
Mol. Mass.:84785.60
Organism:Homo sapiens (Human)
Description:EBI_12662
Residue:769
BDBM50145392
NameBDBM50145392
Synonyms:(S)-2-Methyl-butyric acid (1S,3R,7S,8S,8aR)-8-{2-[(1R,5R)-3-(4-hydroxy-3-methoxy-benzyl)-4-methoxycarbonylmethyl-2-oxo-[1,3]oxazinan-6-yl]-ethyl}-3,7-dimethyl-1,2,3,7,8,8a-hexahydro-naphthalen-1-yl ester | CHEMBL314245
TypeSmall organic molecule
Emp. Form.C34H47NO8
Mol. Mass.597.7389
SMILESCC[C@H](C)C(=O)O[C@H]1C[C@@H](C)C=C2C=C[C@H](C)[C@H](CC[C@@H]3C[C@H](CC(=O)OC)N(Cc4ccc(O)c(OC)c4)C(=O)O3)[C@@H]12