Reaction Details
TargetCorticotropin-releasing factor receptor 1
LigandBDBM50145732
Substrate/Competitorn/a
Meas. Tech.ChEMBL_51106 (CHEMBL666467)
Ki 387.0±n/a nM
Citation Molteni, VPenzotti, JWilson, DMTermin, APMao, LCrane, CMHassman, FWang, TWong, HMiller, KJGrossman, SGrootenhuis, PD N-phenylphenylglycines as novel corticotropin releasing factor receptor antagonists. J Med Chem47:2426-9 (2004) 
 
Corticotropin-releasing factor receptor 1
Name:Corticotropin-releasing factor receptor 1
Type:Enzyme
Mol. Mass.:50744.31
Organism:Homo sapiens (Human)
Description:P34998
Residue:444
BDBM50145732
NameBDBM50145732
Synonyms:2-(2,4-Dichloro-phenylamino)-1-(3-hydroxy-4-methoxy-phenyl)-2-o-tolyl-ethanone | CHEMBL310783
TypeSmall organic molecule
Emp. Form.C22H19Cl2NO3
Mol. Mass.416.297
SMILESCOc1ccc(cc1O)C(=O)C(Nc1ccc(Cl)cc1Cl)c1ccccc1C