Reaction Details
TargetCorticotropin-releasing factor receptor 1
LigandBDBM50145742
Substrate/Competitorn/a
Meas. Tech.ChEMBL_51106 (CHEMBL666467)
Ki 154±n/a nM
Citation Molteni, VPenzotti, JWilson, DMTermin, APMao, LCrane, CMHassman, FWang, TWong, HMiller, KJGrossman, SGrootenhuis, PD N-phenylphenylglycines as novel corticotropin releasing factor receptor antagonists. J Med Chem47:2426-9 (2004) 
 
Corticotropin-releasing factor receptor 1
Name:Corticotropin-releasing factor receptor 1
Type:Enzyme
Mol. Mass.:50744.31
Organism:Homo sapiens (Human)
Description:P34998
Residue:444
BDBM50145742
NameBDBM50145742
Synonyms:(R)-1-(2,4-Dichloro-phenylamino)-4-pyridin-4-yl-1-o-tolyl-butan-2-one | CHEMBL79587
TypeSmall organic molecule
Emp. Form.C22H20Cl2N2O
Mol. Mass.399.313
SMILESCc1ccccc1[C@@H](Nc1ccc(Cl)cc1Cl)C(=O)CCc1ccncc1