Reaction Details
Target5-hydroxytryptamine receptor 2A
LigandBDBM50146343
Substrate/Competitorn/a
Meas. Tech.ChEBML_2276
Ki 433±n/a nM
Citation Cid, JAlonso, JMAndrés, JIFernández, JGil, PIturrino, LMatesanz, EMeert, TFMegens, ASipido, VKTrabanco, AA Synthesis and structure-activity relationship of 2-(aminoalkyl)-3,3a,8,12b-tetrahydro-2H-dibenzocyclohepta[1,2-b]furan derivatives: a novel series of 5-HT(2A/2C) receptor antagonists. Bioorg Med Chem Lett14:2765-71 (2004) 
 
5-hydroxytryptamine receptor 2A
Name:5-hydroxytryptamine receptor 2A
Type:undefined
Mol. Mass.:52607.65
Organism:Homo sapiens (Human)
Description:P28223
Residue:471
BDBM50146343
NameBDBM50146343
Synonyms:(4-Fluoro-phenyl)-{1-[(3aR,12bS)-1-(3,3a,8,12b-tetrahydro-2H-1-oxa-dibenzo[e,h]azulen-2-yl)methyl]-piperidin-4-yl}-methanone | CHEMBL328662
TypeSmall organic molecule
Emp. Form.C30H30FNO2
Mol. Mass.455.5631
SMILESFc1ccc(cc1)C(=O)C1CCN(CC2C[C@H]3[C@H](O2)c2ccccc2Cc2ccccc32)CC1