Reaction Details
TargetHistamine H1 receptor
LigandBDBM50146356
Substrate/Competitorn/a
Meas. Tech.ChEBML_84421
Ki 6±n/a nM
Citation Cid, JAlonso, JMAndrés, JIFernández, JGil, PIturrino, LMatesanz, EMeert, TFMegens, ASipido, VKTrabanco, AA Synthesis and structure-activity relationship of 2-(aminoalkyl)-3,3a,8,12b-tetrahydro-2H-dibenzocyclohepta[1,2-b]furan derivatives: a novel series of 5-HT(2A/2C) receptor antagonists. Bioorg Med Chem Lett14:2765-71 (2004) 
 
Histamine H1 receptor
Name:Histamine H1 receptor
Type:G Protein-Coupled Receptor (GPCR)
Mol. Mass.:55808.72
Organism:Homo sapiens (Human)
Description:Cell pellets from SK-N-MC cells transfected with human H1 receptor were used in binding assay.
Residue:487
BDBM50146356
NameBDBM50146356
Synonyms:CHEMBL328356 | Dimethyl-((3aR,12bS)-8-methyl-3,3a,8,12b-tetrahydro-2H-1-oxa-8-aza-dibenzo[e,h]azulen-2-ylmethyl)-amine
TypeSmall organic molecule
Emp. Form.C20H24N2O
Mol. Mass.308.4174
SMILESCN(C)CC1C[C@H]2[C@H](O1)c1ccccc1N(C)c1ccccc21