Reaction Details
TargetAlpha-2C adrenergic receptor
LigandBDBM50146516
Substrate/Competitorn/a
Meas. Tech.ChEBML_33535
Ki 0.400000±n/a nM
Citation Pastor, JAlcázar, JAlvarez, RMAndrés, JICid, JMDe Lucas, AIDíaz, AFernández, JFont, LMIturrino, LLafuente, CMartínez, SBakker, MHBiesmans, IHeylen, LIMegens, AA Synthesis of 3a,4-dihydro-3H-[1]benzopyrano[4,3-c]isoxazoles, displaying combined 5-HT uptake inhibiting and alpha2-adrenoceptor antagonistic activities. Part 2: Further exploration on the cinnamyl moiety. Bioorg Med Chem Lett14:2917-22 (2004) 
 
Alpha-2C adrenergic receptor
Name:Alpha-2C adrenergic receptor
Type:Enzyme
Mol. Mass.:49552.32
Organism:Homo sapiens (Human)
Description:P18825
Residue:462
BDBM50146516
NameBDBM50146516
Synonyms:(3R,3aS)-3-[4-(3-Furan-2-yl-but-2-enyl)-piperazin-1-ylmethyl]-7,8-dimethoxy-3a,4-dihydro-3H-chromeno[4,3-c]isoxazole | CHEMBL319530
TypeSmall organic molecule
Emp. Form.C25H31N3O5
Mol. Mass.453.5307
SMILESCOc1cc2OC[C@H]3[C@H](CN4CCN(C\C=C(/C)c5ccco5)CC4)ON=C3c2cc1OC