Reaction Details
TargetMaltase-glucoamylase
LigandBDBM19459
Substrate/Competitorn/a
Meas. Tech.ChEMBL_34557 (CHEMBL872366)
Ki 10400±n/a nM
Citation Wang, YMa, LPang, CHuang, MHuang, ZGu, L Synergetic inhibition of genistein and D-glucose on alpha-glucosidase. Bioorg Med Chem Lett14:2947-50 (2004) 
 
Maltase-glucoamylase
Name:Maltase-glucoamylase
Type:Enzyme
Mol. Mass.:209817.06
Organism:Homo sapiens (Human)
Description:O43451
Residue:2753
BDBM19459
NameBDBM19459
Synonyms:5,7-dihydroxy-3-(4-hydroxyphenyl)-4H-chromen-4-one Genistein Genisteol US8552057, 2 | cid_5280961
TypePhytoestrogen
Emp. Form.C15H10O5
Mol. Mass.270.2369
SMILESOc1ccc(cc1)-c1coc2cc(O)cc(O)c2c1=O