Reaction Details
TargetDipeptidyl peptidase 2
LigandBDBM50146960
Substrate/Competitorn/a
Meas. Tech.ChEMBL_53368 (CHEMBL666614)
IC50 1.31±n/a nM
Citation Senten, KVan Der Veken, PDe Meester, ILambeir, AMScharpé, SHaemers, AAugustyns, K Gamma-amino-substituted analogues of 1-[(S)-2,4-diaminobutanoyl]piperidine as highly potent and selective dipeptidyl peptidase II inhibitors. J Med Chem47:2906-16 (2004) 
 
Dipeptidyl peptidase 2
Name:Dipeptidyl peptidase 2
Type:Protein
Mol. Mass.:54339.29
Organism:Homo sapiens (Human)
Description:Q9UHL4
Residue:492
BDBM50146960
NameBDBM50146960
Synonyms:2-(S)-Amino-4-[(naphthalen-1-ylmethyl)-amino]-1-piperidin-1-yl-butan-1-one | CHEMBL97884
TypeSmall organic molecule
Emp. Form.C20H27N3O
Mol. Mass.325.4479
SMILESN[C@@H](CCNCc1cccc2ccccc12)C(=O)N1CCCCC1