Reaction Details
TargetDipeptidyl peptidase 2
LigandBDBM50146988
Substrate/Competitorn/a
Meas. Tech.ChEMBL_53368 (CHEMBL666614)
IC50 1.5±n/a nM
Citation Senten, KVan Der Veken, PDe Meester, ILambeir, AMScharpé, SHaemers, AAugustyns, K Gamma-amino-substituted analogues of 1-[(S)-2,4-diaminobutanoyl]piperidine as highly potent and selective dipeptidyl peptidase II inhibitors. J Med Chem47:2906-16 (2004) 
 
Dipeptidyl peptidase 2
Name:Dipeptidyl peptidase 2
Type:Protein
Mol. Mass.:54339.29
Organism:Homo sapiens (Human)
Description:Q9UHL4
Residue:492
BDBM50146988
NameBDBM50146988
Synonyms:CHEMBL440325 | N-((S)-3-Amino-4-oxo-4-piperidin-1-yl-butyl)-acetamide
TypeSmall organic molecule
Emp. Form.C11H21N3O2
Mol. Mass.227.3033
SMILESCC(=O)NCC[C@H](N)C(=O)N1CCCCC1