Reaction Details
TargetDipeptidyl peptidase 2
LigandBDBM50146985
Substrate/Competitorn/a
Meas. Tech.ChEMBL_53368 (CHEMBL666614)
IC50 0.62±n/a nM
Citation Senten, KVan Der Veken, PDe Meester, ILambeir, AMScharpé, SHaemers, AAugustyns, K Gamma-amino-substituted analogues of 1-[(S)-2,4-diaminobutanoyl]piperidine as highly potent and selective dipeptidyl peptidase II inhibitors. J Med Chem47:2906-16 (2004) 
 
Dipeptidyl peptidase 2
Name:Dipeptidyl peptidase 2
Type:Protein
Mol. Mass.:54339.29
Organism:Homo sapiens (Human)
Description:Q9UHL4
Residue:492
BDBM50146985
NameBDBM50146985
Synonyms:(S)-2-Amino-4-(4-chloro-benzylamino)-1-(3-fluoro-piperidin-1-yl)-butan-1-one | CHEMBL98060
TypeSmall organic molecule
Emp. Form.C16H23ClFN3O
Mol. Mass.327.825
SMILESN[C@@H](CCNCc1ccc(Cl)cc1)C(=O)N1CCCC(F)C1