Reaction Details
TargetNeuromedin-B receptor
LigandBDBM50147019
Substrate/Competitorn/a
Meas. Tech.ChEMBL_143203 (CHEMBL752220)
EC50 17.7±n/a nM
Citation Shuttleworth, SJLizarzaburu, MEChai, ACoward, P Identification and optimization of novel partial agonists of neuromedin B receptor using parallel synthesis. Bioorg Med Chem Lett14:3037-42 (2004) 
 
Neuromedin-B receptor
Name:Neuromedin-B receptor
Type:Enzyme Catalytic Domain
Mol. Mass.:43447.11
Organism:Homo sapiens (Human)
Description:Bombesin 1 NMBR 0::P28336
Residue:390
BDBM50147019
NameBDBM50147019
Synonyms:3-[3-(2,6-Diisopropyl-phenyl)-ureido]-5-methoxy-2,3,4,9-tetrahydro-1H-carbazole-3-carboxylic acid (1-pyridin-2-yl-cyclohexylmethyl)-amide | CHEMBL103756
TypeSmall organic molecule
Emp. Form.C39H49N5O3
Mol. Mass.635.8381
SMILESCOc1cccc2[nH]c3CCC(Cc3c12)(NC(=O)Nc1c(cccc1C(C)C)C(C)C)C(=O)NCC1(CCCCC1)c1ccccn1