Reaction Details
TargetNeuromedin-B receptor
LigandBDBM50147031
Substrate/Competitorn/a
Meas. Tech.ChEBML_143203
IC50 800±n/a nM
Citation Shuttleworth, SJLizarzaburu, MEChai, ACoward, P Identification and optimization of novel partial agonists of neuromedin B receptor using parallel synthesis. Bioorg Med Chem Lett14:3037-42 (2004) 
 
Neuromedin-B receptor
Name:Neuromedin-B receptor
Type:Enzyme Catalytic Domain
Mol. Mass.:43447.11
Organism:Homo sapiens (Human)
Description:Bombesin 1 NMBR 0::P28336
Residue:390
BDBM50147031
NameBDBM50147031
Synonyms:3-[3-(4-Nitro-phenyl)-ureido]-2,3,4,9-tetrahydro-1H-carbazole-3-carboxylic acid (1-pyridin-2-yl-cyclohexylmethyl)-amide | CHEMBL103440
TypeSmall organic molecule
Emp. Form.C32H34N6O4
Mol. Mass.566.6502
SMILES[O-][N+](=O)c1ccc(NC(=O)NC2(CCc3[nH]c4ccccc4c3C2)C(=O)NCC2(CCCCC2)c2ccccn2)cc1