Reaction Details
TargetNeuromedin-B receptor
LigandBDBM50147035
Substrate/Competitorn/a
Meas. Tech.ChEBML_143203
IC50 620±n/a nM
Citation Shuttleworth, SJLizarzaburu, MEChai, ACoward, P Identification and optimization of novel partial agonists of neuromedin B receptor using parallel synthesis. Bioorg Med Chem Lett14:3037-42 (2004) 
 
Neuromedin-B receptor
Name:Neuromedin-B receptor
Type:Enzyme Catalytic Domain
Mol. Mass.:43447.11
Organism:Homo sapiens (Human)
Description:Bombesin 1 NMBR 0::P28336
Residue:390
BDBM50147035
NameBDBM50147035
Synonyms:3-[3-(2-Methyl-4-nitro-phenyl)-ureido]-2,3,4,9-tetrahydro-1H-carbazole-3-carboxylic acid (1-pyridin-2-yl-cyclohexylmethyl)-amide | CHEMBL103439
TypeSmall organic molecule
Emp. Form.C33H36N6O4
Mol. Mass.580.6767
SMILESCc1cc(ccc1NC(=O)NC1(CCc2[nH]c3ccccc3c2C1)C(=O)NCC1(CCCCC1)c1ccccn1)[N+]([O-])=O