Reaction Details
TargetNeuromedin-B receptor
LigandBDBM50147036
Substrate/Competitorn/a
Meas. Tech.ChEBML_143203
IC50 700±n/a nM
Citation Shuttleworth, SJLizarzaburu, MEChai, ACoward, P Identification and optimization of novel partial agonists of neuromedin B receptor using parallel synthesis. Bioorg Med Chem Lett14:3037-42 (2004) 
 
Neuromedin-B receptor
Name:Neuromedin-B receptor
Type:Enzyme Catalytic Domain
Mol. Mass.:43447.11
Organism:Homo sapiens (Human)
Description:Bombesin 1 NMBR 0::P28336
Residue:390
BDBM50147036
NameBDBM50147036
Synonyms:3-[3-(2,6-Diisopropyl-phenyl)-ureido]-4,6-dimethyl-2,3,4,9-tetrahydro-1H-carbazole-3-carboxylic acid (1-pyridin-2-yl-cyclohexylmethyl)-amide | CHEMBL100065
TypeSmall organic molecule
Emp. Form.C40H51N5O2
Mol. Mass.633.8652
SMILESCC(C)c1cccc(C(C)C)c1NC(=O)NC1(CCc2[nH]c3ccc(C)cc3c2C1C)C(=O)NCC1(CCCCC1)c1ccccn1