Reaction Details
TargetEpidermal growth factor receptor
LigandBDBM50029668
Substrate/Competitorn/a
Meas. Tech.ChEMBL_2145644 (CHEMBL5029924)
IC50 1.2±n/a nM
Citation Hoogenboom, NDemont, Dde Zwart, EVerkaik, SEmmelot, Mvan de Kar, BKaptein, ABarf, T Discovery and optimization of covalent EGFR T790M/L858R mutant inhibitors. Bioorg Med Chem Lett52:0 (2021) 
 
Epidermal growth factor receptor
Name:Epidermal growth factor receptor
Type:Receptor Kinase Domain
Mol. Mass.:134279.59
Organism:Homo sapiens (Human)
Description:P00533
Residue:1210
BDBM50029668
NameBDBM50029668
Synonyms:AZD-9291 US10085983, Compound AZD-9291 US11111233, Example AZD9291 US20230322822, Compound AZD9291 WO2022090481, Example osimertinib
TypeSmall organic molecule
Emp. Form.C28H33N7O2
Mol. Mass.499.6073
SMILESCOc1cc(N(C)CCN(C)C)c(NC(=O)C=C)cc1Nc1nccc(n1)-c1cn(C)c2ccccc12