Reaction Details
TargetKallikrein-1
LigandBDBM50147090
Substrate/Competitorn/a
Meas. Tech.ChEBML_148015
Ki 3300±n/a nM
Citation Wendt, MDGeyer, AMcClellan, WJRockway, TWWeitzberg, MZhao, XMantei, RStewart, KNienaber, VKlinghofer, VGiranda, VL Interaction with the S1 beta-pocket of urokinase: 8-heterocycle substituted and 6,8-disubstituted 2-naphthamidine urokinase inhibitors. Bioorg Med Chem Lett14:3063-8 (2004) 
 
Kallikrein-1
Name:Kallikrein-1
Type:Enzyme
Mol. Mass.:28874.69
Organism:Homo sapiens (Human)
Description:P06870
Residue:262
BDBM50147090
NameBDBM50147090
Synonyms:7-Methoxy-8-(tetrahydro-furan-3-yl)-naphthalene-2-carboxamidine | CHEMBL320817
TypeSmall organic molecule
Emp. Form.C16H18N2O2
Mol. Mass.270.3263
SMILESCOc1ccc2ccc(cc2c1C1CCOC1)C(N)=N