Reaction Details
TargetKallikrein-1
LigandBDBM50147091
Substrate/Competitorn/a
Meas. Tech.ChEBML_148015
Ki 19±n/a nM
Citation Wendt, MDGeyer, AMcClellan, WJRockway, TWWeitzberg, MZhao, XMantei, RStewart, KNienaber, VKlinghofer, VGiranda, VL Interaction with the S1 beta-pocket of urokinase: 8-heterocycle substituted and 6,8-disubstituted 2-naphthamidine urokinase inhibitors. Bioorg Med Chem Lett14:3063-8 (2004) 
 
Kallikrein-1
Name:Kallikrein-1
Type:Enzyme
Mol. Mass.:28874.69
Organism:Homo sapiens (Human)
Description:P06870
Residue:262
BDBM50147091
NameBDBM50147091
Synonyms:6-Carbamimidoyl-4-(5-ethanesulfonyl-furan-3-yl)-naphthalene-2-carboxylic acid phenylamide | CHEMBL321319
TypeSmall organic molecule
Emp. Form.C24H21N3O4S
Mol. Mass.447.506
SMILESCCS(=O)(=O)c1cc(co1)-c1cc(cc2ccc(cc12)C(N)=N)C(=O)Nc1ccccc1