Reaction Details
TargetKallikrein-1
LigandBDBM50147086
Substrate/Competitorn/a
Meas. Tech.ChEBML_148015
Ki 1000±n/a nM
Citation Wendt, MDGeyer, AMcClellan, WJRockway, TWWeitzberg, MZhao, XMantei, RStewart, KNienaber, VKlinghofer, VGiranda, VL Interaction with the S1 beta-pocket of urokinase: 8-heterocycle substituted and 6,8-disubstituted 2-naphthamidine urokinase inhibitors. Bioorg Med Chem Lett14:3063-8 (2004) 
 
Kallikrein-1
Name:Kallikrein-1
Type:Enzyme
Mol. Mass.:28874.69
Organism:Homo sapiens (Human)
Description:P06870
Residue:262
BDBM50147086
NameBDBM50147086
Synonyms:8-(PYRIMIDIN-2-YLAMINO)NAPHTHALENE-2-CARBOXIMIDAMIDE | CHEMBL103043
TypeSmall organic molecule
Emp. Form.C15H13N5
Mol. Mass.263.2972
SMILESNC(=N)c1ccc2cccc(Nc3ncccn3)c2c1