Reaction Details
TargetSerine protease 1
LigandBDBM50147085
Substrate/Competitorn/a
Meas. Tech.ChEBML_213066
Ki 2700±n/a nM
Citation Wendt, MDGeyer, AMcClellan, WJRockway, TWWeitzberg, MZhao, XMantei, RStewart, KNienaber, VKlinghofer, VGiranda, VL Interaction with the S1 beta-pocket of urokinase: 8-heterocycle substituted and 6,8-disubstituted 2-naphthamidine urokinase inhibitors. Bioorg Med Chem Lett14:3063-8 (2004) 
 
Serine protease 1
Name:Serine protease 1
Type:Enzyme
Mol. Mass.:26557.80
Organism:Homo sapiens (Human)
Description:P07477
Residue:247
BDBM50147085
NameBDBM50147085
Synonyms:7-METHOXY-8-[1-(METHYLSULFONYL)-1H-PYRAZOL-4-YL]NAPHTHALENE-2-CARBOXIMIDAMIDE 8-(1-Methanesulfonyl-1H-pyrazol-4-yl)-7-methoxy-naphthalene-2-carboxamidine uPa_13
TypeSmall organic molecule
Emp. Form.C16H16N4O3S
Mol. Mass.344.388
SMILESCOc1ccc2ccc(cc2c1-c1cnn(c1)S(C)(=O)=O)C(N)=N