Reaction Details
TargetTissue-type plasminogen activator
LigandBDBM50147085
Substrate/Competitorn/a
Meas. Tech.ChEBML_208233
Ki>100000±n/a nM
Citation Wendt, MDGeyer, AMcClellan, WJRockway, TWWeitzberg, MZhao, XMantei, RStewart, KNienaber, VKlinghofer, VGiranda, VL Interaction with the S1 beta-pocket of urokinase: 8-heterocycle substituted and 6,8-disubstituted 2-naphthamidine urokinase inhibitors. Bioorg Med Chem Lett14:3063-8 (2004) 
 
Tissue-type plasminogen activator
Name:Tissue-type plasminogen activator
Type:Enzyme
Mol. Mass.:62931.08
Organism:Homo sapiens (Human)
Description:n/a
Residue:562
BDBM50147085
NameBDBM50147085
Synonyms:7-METHOXY-8-[1-(METHYLSULFONYL)-1H-PYRAZOL-4-YL]NAPHTHALENE-2-CARBOXIMIDAMIDE 8-(1-Methanesulfonyl-1H-pyrazol-4-yl)-7-methoxy-naphthalene-2-carboxamidine uPa_13
TypeSmall organic molecule
Emp. Form.C16H16N4O3S
Mol. Mass.344.388
SMILESCOc1ccc2ccc(cc2c1-c1cnn(c1)S(C)(=O)=O)C(N)=N