Reaction Details
TargetTissue-type plasminogen activator
LigandBDBM50147086
Substrate/Competitorn/a
Meas. Tech.ChEBML_208233
Ki 24000±n/a nM
Citation Wendt, MDGeyer, AMcClellan, WJRockway, TWWeitzberg, MZhao, XMantei, RStewart, KNienaber, VKlinghofer, VGiranda, VL Interaction with the S1 beta-pocket of urokinase: 8-heterocycle substituted and 6,8-disubstituted 2-naphthamidine urokinase inhibitors. Bioorg Med Chem Lett14:3063-8 (2004) 
 
Tissue-type plasminogen activator
Name:Tissue-type plasminogen activator
Type:Enzyme
Mol. Mass.:62931.08
Organism:Homo sapiens (Human)
Description:n/a
Residue:562
BDBM50147086
NameBDBM50147086
Synonyms:8-(PYRIMIDIN-2-YLAMINO)NAPHTHALENE-2-CARBOXIMIDAMIDE | CHEMBL103043
TypeSmall organic molecule
Emp. Form.C15H13N5
Mol. Mass.263.2972
SMILESNC(=N)c1ccc2cccc(Nc3ncccn3)c2c1