Reaction Details
TargetTissue-type plasminogen activator
LigandBDBM50147094
Substrate/Competitorn/a
Meas. Tech.ChEBML_208233
Ki 3300±n/a nM
Citation Wendt, MDGeyer, AMcClellan, WJRockway, TWWeitzberg, MZhao, XMantei, RStewart, KNienaber, VKlinghofer, VGiranda, VL Interaction with the S1 beta-pocket of urokinase: 8-heterocycle substituted and 6,8-disubstituted 2-naphthamidine urokinase inhibitors. Bioorg Med Chem Lett14:3063-8 (2004) 
 
Tissue-type plasminogen activator
Name:Tissue-type plasminogen activator
Type:Enzyme
Mol. Mass.:62931.08
Organism:Homo sapiens (Human)
Description:n/a
Residue:562
BDBM50147094
NameBDBM50147094
Synonyms:6-Carbamimidoyl-4-(5-ethylsulfanyl-furan-3-yl)-naphthalene-2-carboxylic acid phenylamide | CHEMBL104211
TypeSmall organic molecule
Emp. Form.C24H21N3O2S
Mol. Mass.415.507
SMILESCCSc1cc(co1)-c1cc(cc2ccc(cc12)C(N)=N)C(=O)Nc1ccccc1