Reaction Details
TargetProthrombin
LigandBDBM50147093
Substrate/Competitorn/a
Meas. Tech.ChEBML_209089
Ki 940.0±n/a nM
Citation Wendt, MDGeyer, AMcClellan, WJRockway, TWWeitzberg, MZhao, XMantei, RStewart, KNienaber, VKlinghofer, VGiranda, VL Interaction with the S1 beta-pocket of urokinase: 8-heterocycle substituted and 6,8-disubstituted 2-naphthamidine urokinase inhibitors. Bioorg Med Chem Lett14:3063-8 (2004) 
 
Prothrombin
Name:Prothrombin
Type:Protein
Mol. Mass.:70029.57
Organism:Homo sapiens (Human)
Description:P00734
Residue:622
BDBM50147093
NameBDBM50147093
Synonyms:6-Carbamimidoyl-4-(pyrimidin-2-ylamino)-naphthalene-2-carboxylic acid (4-aminomethyl-phenyl)-amide CHEMBL104166 | N-(4-(aminomethyl)phenyl)-6-carbamimidoyl-4-(pyrimidin-2-ylamino)-2-naphthamide
TypeSmall organic molecule
Emp. Form.C23H21N7O
Mol. Mass.411.4591
SMILESNCc1ccc(NC(=O)c2cc(Nc3ncccn3)c3cc(ccc3c2)C(N)=N)cc1