Reaction Details
TargetTissue-type plasminogen activator
LigandBDBM50138670
Substrate/Competitorn/a
Meas. Tech.ChEBML_208233
Ki 32000±n/a nM
Citation Wendt, MDGeyer, AMcClellan, WJRockway, TWWeitzberg, MZhao, XMantei, RStewart, KNienaber, VKlinghofer, VGiranda, VL Interaction with the S1 beta-pocket of urokinase: 8-heterocycle substituted and 6,8-disubstituted 2-naphthamidine urokinase inhibitors. Bioorg Med Chem Lett14:3063-8 (2004) 
 
Tissue-type plasminogen activator
Name:Tissue-type plasminogen activator
Type:Enzyme
Mol. Mass.:62931.08
Organism:Homo sapiens (Human)
Description:n/a
Residue:562
BDBM50138670
NameBDBM50138670
Synonyms:6-Carbamimidoyl-naphthalene-2-carboxylic acid phenylamide 6-carbamimidoyl-N-phenyl-2-naphthamide uPa_7
TypeSmall organic molecule
Emp. Form.C18H15N3O
Mol. Mass.289.3312
SMILESNC(=N)c1ccc2cc(ccc2c1)C(=O)Nc1ccccc1