Reaction Details
TargetHeparanase
LigandBDBM50147544
Substrate/Competitorn/a
Meas. Tech.ChEBML_83907
IC50 400±n/a nM
Citation Courtney, SMHay, PABuck, RTColville, CSPorter, DWScopes, DIPollard, FCPage, MJBennett, JMHircock, MLMcKenzie, EAStubberfield, CRTurner, PR 2,3-Dihydro-1,3-dioxo-1H-isoindole-5-carboxylic acid derivatives: a novel class of small molecule heparanase inhibitors. Bioorg Med Chem Lett14:3269-73 (2004) 
 
Heparanase
Name:Heparanase
Type:PROTEIN
Mol. Mass.:61167.67
Organism:Homo sapiens (Human)
Description:ChEMBL_327900
Residue:543
BDBM50147544
NameBDBM50147544
Synonyms:2-(2-methoxy-5-(5-(4-(trifluoromethoxy)phenyl)benzo[d]oxazol-2-yl)phenyl)-1,3-dioxoisoindoline-5-carboxylic acid CHEMBL112849
TypeSmall organic molecule
Emp. Form.C30H17F3N2O7
Mol. Mass.574.4604
SMILESCOc1ccc(cc1N1C(=O)c2ccc(cc2C1=O)C(O)=O)-c1nc2cc(ccc2o1)-c1ccc(OC(F)(F)F)cc1