Reaction Details
TargetDynamin-1
LigandBDBM50060597
Substrate/Competitorn/a
Meas. Tech.ChEBML_60874
IC50 9680±n/a nM
Citation Hill, TAOdell, LRQuan, AAbagyan, RFerguson, GRobinson, PJMcCluskey, A Long chain amines and long chain ammonium salts as novel inhibitors of dynamin GTPase activity. Bioorg Med Chem Lett14:3275-8 (2004) 
 
Dynamin-1
Name:Dynamin-1
Type:PROTEIN
Mol. Mass.:97411.67
Organism:Homo sapiens (Human)
Description:ChEMBL_1458576
Residue:864
BDBM50060597
NameBDBM50060597
Synonyms:CHEMBL109747 CHEMBL325636 N,N,N-trimethyltetradecan-1-aminium bromide Trimethyl-tetradecyl-ammonium; bromide
TypeSmall organic molecule
Emp. Form.C17H38N
Mol. Mass.256.4898
[N+](C)(C)C