Reaction Details
TargetDynamin-1
LigandBDBM50147557
Substrate/Competitorn/a
Meas. Tech.ChEBML_60874
IC50 7370±n/a nM
Citation Hill, TAOdell, LRQuan, AAbagyan, RFerguson, GRobinson, PJMcCluskey, A Long chain amines and long chain ammonium salts as novel inhibitors of dynamin GTPase activity. Bioorg Med Chem Lett14:3275-8 (2004) 
 
Dynamin-1
Name:Dynamin-1
Type:PROTEIN
Mol. Mass.:97411.67
Organism:Homo sapiens (Human)
Description:ChEMBL_1458576
Residue:864
BDBM50147557
NameBDBM50147557
Synonyms:2-Tetradecyloxy-propane-1,3-diammonium chloride | CHEMBL111027
TypeSmall organic molecule
Emp. Form.C17H40N2O
Mol. Mass.288.5112
(C[NH3+])C[NH3+]