Reaction Details
TargetDynamin-1
LigandBDBM50147563
Substrate/Competitorn/a
Meas. Tech.ChEBML_60874
IC50 3150±n/a nM
Citation Hill, TAOdell, LRQuan, AAbagyan, RFerguson, GRobinson, PJMcCluskey, A Long chain amines and long chain ammonium salts as novel inhibitors of dynamin GTPase activity. Bioorg Med Chem Lett14:3275-8 (2004) 
 
Dynamin-1
Name:Dynamin-1
Type:PROTEIN
Mol. Mass.:97411.67
Organism:Homo sapiens (Human)
Description:ChEMBL_1458576
Residue:864
BDBM50147563
NameBDBM50147563
Synonyms:CHEMBL109458 | Trimethyl-octadecyl-ammonium; bromide
TypeSmall organic molecule
Emp. Form.C21H46N
Mol. Mass.312.5961
[N+](C)(C)C