Reaction Details
TargetDynamin-1
LigandBDBM50060599
Substrate/Competitorn/a
Meas. Tech.ChEBML_60874
IC50 16320±n/a nM
Citation Hill, TAOdell, LRQuan, AAbagyan, RFerguson, GRobinson, PJMcCluskey, A Long chain amines and long chain ammonium salts as novel inhibitors of dynamin GTPase activity. Bioorg Med Chem Lett14:3275-8 (2004) 
 
Dynamin-1
Name:Dynamin-1
Type:PROTEIN
Mol. Mass.:97411.67
Organism:Homo sapiens (Human)
Description:ChEMBL_1458576
Residue:864
BDBM50060599
NameBDBM50060599
Synonyms:CHEMBL109873 | Dodecyl-trimethyl-ammonium; bromide
TypeSmall organic molecule
Emp. Form.C15H34N
Mol. Mass.228.4366
SMILESCCCCCCCCCCCC[N+](C)(C)C