Reaction Details
TargetAdenosine receptor A2a
LigandBDBM50147652
Substrate/Competitorn/a
Meas. Tech.ChEBML_31364
Ki 76±n/a nM
Citation Guba, WNettekoven, MPüllmann, BRiemer, CSchmitt, S Comparison of inhibitory activity of isomeric triazolopyridine derivatives towards adenosine receptor subtypes or do similar structures reveal similar bioactivities? Bioorg Med Chem Lett14:3307-12 (2004) 
 
Adenosine receptor A2a
Name:Adenosine receptor A2a
Type:G Protein-Coupled Receptor (GPCR)
Mol. Mass.:44716.46
Organism:Homo sapiens (Human)
Description:P29274
Residue:412
BDBM50147652
NameBDBM50147652
Synonyms:8-Amino-2-(5-bromo-furan-2-yl)-[1,2,4]triazolo[1,5-a]pyridine-6-carboxylic acid ethyl-(2-pyridin-2-yl-ethyl)-amide | CHEMBL113468
TypeSmall organic molecule
Emp. Form.C20H19BrN6O2
Mol. Mass.455.308
SMILESCCN(CCc1ccccn1)C(=O)c1cc(N)c2nc(nn2c1)-c1ccc(Br)o1