Reaction Details
TargetAdenosine receptor A2a
LigandBDBM50147662
Substrate/Competitorn/a
Meas. Tech.ChEBML_31364
Ki 35±n/a nM
Citation Guba, WNettekoven, MPüllmann, BRiemer, CSchmitt, S Comparison of inhibitory activity of isomeric triazolopyridine derivatives towards adenosine receptor subtypes or do similar structures reveal similar bioactivities? Bioorg Med Chem Lett14:3307-12 (2004) 
 
Adenosine receptor A2a
Name:Adenosine receptor A2a
Type:G Protein-Coupled Receptor (GPCR)
Mol. Mass.:44716.46
Organism:Homo sapiens (Human)
Description:P29274
Residue:412
BDBM50147662
NameBDBM50147662
Synonyms:CHEMBL112195 | [8-Amino-2-(5-bromo-furan-2-yl)-[1,2,4]triazolo[1,5-a]pyridin-6-yl]-pyrrolidin-1-yl-methanone
TypeSmall organic molecule
Emp. Form.C15H14BrN5O2
Mol. Mass.376.208
SMILESNc1cc(cn2nc(nc12)-c1ccc(Br)o1)C(=O)N1CCCC1