Reaction Details
TargetAdenosine receptor A1
LigandBDBM21190
Substrate/Competitorn/a
Meas. Tech.ChEBML_27572
Ki 255±n/a nM
Citation Guba, WNettekoven, MPüllmann, BRiemer, CSchmitt, S Comparison of inhibitory activity of isomeric triazolopyridine derivatives towards adenosine receptor subtypes or do similar structures reveal similar bioactivities? Bioorg Med Chem Lett14:3307-12 (2004) 
 
Adenosine receptor A1
Name:Adenosine receptor A1
Type:G Protein-Coupled Receptor (GPCR)
Mol. Mass.:36520.92
Organism:Homo sapiens (Human)
Description:P30542
Residue:326
BDBM21190
NameBDBM21190
Synonyms:4-(2-{[5-amino-2-(furan-2-yl)-[1,2,4]triazolo[1,5-a][1,3,5]triazin-7-yl]amino}ethyl)phenol ZM 241385 [3H]-ZM241385
TypeSmall organic molecule
Emp. Form.C16H15N7O2
Mol. Mass.337.336
SMILESNc1nc(NCCc2ccc(O)cc2)nc2nc(nn12)-c1ccco1