Reaction Details
TargetNociceptin receptor
LigandBDBM50147744
Substrate/Competitorn/a
Meas. Tech.ChEMBL_144653 (CHEMBL752667)
EC50>10000±n/a nM
Citation Zaveri, NTJiang, FOlsen, CMDeschamps, JRParrish, DPolgar, WToll, L A novel series of piperidin-4-yl-1,3-dihydroindol-2-ones as agonist and antagonist ligands at the nociceptin receptor. J Med Chem47:2973-6 (2004) 
 
Nociceptin receptor
Name:Nociceptin receptor
Type:G Protein-Coupled Receptor (GPCR)
Mol. Mass.:40702.87
Organism:Homo sapiens (Human)
Description:P41146
Residue:370
BDBM50147744
NameBDBM50147744
Synonyms:1-{1-[1-(4-Cyclohexyl-phenyl)-ethyl]-piperidin-4-yl}-1,3-dihydro-indol-2-one | CHEMBL97979
TypeSmall organic molecule
Emp. Form.C27H34N2O
Mol. Mass.402.5717
SMILESCC(N1CCC(CC1)N1C(=O)Cc2ccccc12)c1ccc(cc1)C1CCCCC1