Reaction Details
TargetNociceptin receptor
LigandBDBM50147742
Substrate/Competitorn/a
Meas. Tech.ChEMBL_144654 (CHEMBL752668)
Ki 4.7±n/a nM
Citation Zaveri, NTJiang, FOlsen, CMDeschamps, JRParrish, DPolgar, WToll, L A novel series of piperidin-4-yl-1,3-dihydroindol-2-ones as agonist and antagonist ligands at the nociceptin receptor. J Med Chem47:2973-6 (2004) 
 
Nociceptin receptor
Name:Nociceptin receptor
Type:G Protein-Coupled Receptor (GPCR)
Mol. Mass.:40702.87
Organism:Homo sapiens (Human)
Description:P41146
Residue:370
BDBM50147742
NameBDBM50147742
Synonyms:1-[(R)-1-(Decahydro-naphthalen-2-yl)-piperidin-4-yl]-1,3-dihydro-indol-2-one | CHEMBL319307
TypeSmall organic molecule
Emp. Form.C23H32N2O
Mol. Mass.352.513
SMILESO=C1Cc2ccccc2N1C1CCN(CC1)C1CCC2CCCC[C@@H]2C1