Reaction Details
TargetNociceptin receptor
LigandBDBM50147735
Substrate/Competitorn/a
Meas. Tech.ChEMBL_144654 (CHEMBL752668)
Ki 4±n/a nM
Citation Zaveri, NTJiang, FOlsen, CMDeschamps, JRParrish, DPolgar, WToll, L A novel series of piperidin-4-yl-1,3-dihydroindol-2-ones as agonist and antagonist ligands at the nociceptin receptor. J Med Chem47:2973-6 (2004) 
 
Nociceptin receptor
Name:Nociceptin receptor
Type:G Protein-Coupled Receptor (GPCR)
Mol. Mass.:40702.87
Organism:Homo sapiens (Human)
Description:P41146
Residue:370
BDBM50147735
NameBDBM50147735
Synonyms:1-[1-(4-Isopropyl-cyclohexyl)-piperidin-4-yl]-1,3-dihydro-indol-2-one | CHEMBL418980
TypeSmall organic molecule
Emp. Form.C22H32N2O
Mol. Mass.340.5023
SMILESCC(C)[C@H]1CC[C@H](CC1)N1CCC(CC1)N1C(=O)Cc2ccccc12