Reaction Details
TargetMu-type opioid receptor
LigandBDBM50147735
Substrate/Competitorn/a
Meas. Tech.ChEMBL_148097 (CHEMBL751579)
Ki 8±n/a nM
Citation Zaveri, NTJiang, FOlsen, CMDeschamps, JRParrish, DPolgar, WToll, L A novel series of piperidin-4-yl-1,3-dihydroindol-2-ones as agonist and antagonist ligands at the nociceptin receptor. J Med Chem47:2973-6 (2004) 
 
Mu-type opioid receptor
Name:Mu-type opioid receptor
Type:G Protein-Coupled Receptor (GPCR)
Mol. Mass.:44789.51
Organism:Homo sapiens (Human)
Description:P35372
Residue:400
BDBM50147735
NameBDBM50147735
Synonyms:1-[1-(4-Isopropyl-cyclohexyl)-piperidin-4-yl]-1,3-dihydro-indol-2-one | CHEMBL418980
TypeSmall organic molecule
Emp. Form.C22H32N2O
Mol. Mass.340.5023
SMILESCC(C)[C@H]1CC[C@H](CC1)N1CCC(CC1)N1C(=O)Cc2ccccc12