Reaction Details
TargetNociceptin receptor
LigandBDBM50147741
Substrate/Competitorn/a
Meas. Tech.ChEMBL_144654 (CHEMBL752668)
Ki 12±n/a nM
Citation Zaveri, NTJiang, FOlsen, CMDeschamps, JRParrish, DPolgar, WToll, L A novel series of piperidin-4-yl-1,3-dihydroindol-2-ones as agonist and antagonist ligands at the nociceptin receptor. J Med Chem47:2973-6 (2004) 
 
Nociceptin receptor
Name:Nociceptin receptor
Type:G Protein-Coupled Receptor (GPCR)
Mol. Mass.:40702.87
Organism:Homo sapiens (Human)
Description:P41146
Residue:370
BDBM50147741
NameBDBM50147741
Synonyms:1-[1-(1,2,3,4-Tetrahydro-naphthalen-1-yl)-piperidin-4-yl]-1,3-dihydro-indol-2-one | CHEMBL101118
TypeSmall organic molecule
Emp. Form.C23H26N2O
Mol. Mass.346.4653
SMILESO=C1Cc2ccccc2N1C1CCN(CC1)C1CCCc2ccccc12