Reaction Details
TargetNociceptin receptor
LigandBDBM50147747
Substrate/Competitorn/a
Meas. Tech.ChEMBL_144653 (CHEMBL752667)
EC50 117±n/a nM
Citation Zaveri, NTJiang, FOlsen, CMDeschamps, JRParrish, DPolgar, WToll, L A novel series of piperidin-4-yl-1,3-dihydroindol-2-ones as agonist and antagonist ligands at the nociceptin receptor. J Med Chem47:2973-6 (2004) 
 
Nociceptin receptor
Name:Nociceptin receptor
Type:G Protein-Coupled Receptor (GPCR)
Mol. Mass.:40702.87
Organism:Homo sapiens (Human)
Description:P41146
Residue:370
BDBM50147747
NameBDBM50147747
Synonyms:1-[1-(Decahydro-naphthalen-1-yl)-piperidin-4-yl]-1,3-dihydro-indol-2-one | CHEMBL320182
TypeSmall organic molecule
Emp. Form.C23H32N2O
Mol. Mass.352.513
SMILESO=C1Cc2ccccc2N1C1CCN(CC1)C1CCCC2CCCCC12